{"text_format":"1","workbook":"xlsx","n_sheets":7,"sheets":["Mentett","KronoBiológia","KronoAdatok","KronoMagyarázat","Info","KronoElemzés","Regisztráció"],"not_rendered":{"charts":0,"images":1,"macros":1,"external_links":1,"defined_names":2,"comments":0,"pivot_tables":0},"unopened":[],"bounds":{"document_bytes":16777216,"sheet_cells":100000,"rows_first":2000,"rows_last":500,"rows_between":2000,"halvings":0,"cell_chars":16384,"cell_head_chars":4096},"cells_cut":0,"cells_raw":0,"read":"whole","date_system":"1900"}

{"sheet":"Mentett","index":0,"n_rows":9,"n_cols":5,"rows_kept":9,"cut":false,"hidden":true,"merged":[]}
["Sorszám","Név","Év","Hó","Nap"]
[1,"Mel Gibson",1956,1,3]
[2,"Vanessa Paradis",1972,12,22]
[3,"Bruce Willis",1955,3,19]
[4,"Nicole Kidman",1967,6,20]
[5,"Liam Neeson",1952,6,7]
[6,"Sylvester Stallone",1946,7,6]
[7,"Keanu Reeves",1964,9,2]
[8,"Nicolas Cage",1964,1,7]

{"sheet":"KronoBiológia","index":1,"n_rows":33,"n_cols":10,"rows_kept":33,"cut":false,"hidden":false,"merged":[[3,3,3,6]]}
[]
[null,null,"Csak ezt a mezőt kell tölteni",null,"Év","Hónap","Nap"]
[null,null,"Szülési idő",null,1972,12,22]
[null,null,"Név","Vanessa Paradis"]
[null,null,"A program tulajdonosa:","DEMO"]
[]
[null,null,"Évszám",null,{"$f":"VLOOKUP(E3,KronoAdatok!A2:E139,2)","v":21},{"$f":"VLOOKUP(E3,KronoAdatok!A2:E138,3)","v":11},{"$f":"VLOOKUP(E3,KronoAdatok!A2:E138,4)","v":20},{"$f":"IF(VLOOKUP(E3,KronoAdatok!A2:E138,5)=1,\"Szökőév\",\"\")","v":"Szökőév"}]
[null,null,"Hónapszám",{"$f":"IF(F3<3,IF(H7=\"Szökőév\",12,0),0)","v":0},{"$f":"VLOOKUP(F3+D8,KronoAdatok!G2:L15,4)","v":0},{"$f":"VLOOKUP(F3+D8,KronoAdatok!G2:L15,5)","v":0},{"$f":"VLOOKUP(F3+D8,KronoAdatok!G2:L15,6)","v":0},{"$f":"VLOOKUP(F3+D8,KronoAdatok!G2:L15,3)","v":31}]
[null,null,"Hany nap a hónap végig",null,{"$f":"H8-G3","v":9},{"$f":"H8-G3","v":9},{"$f":"H8-G3","v":9}]
[null,null,null,null,{"$f":"SUM(E7:E9)","v":30},{"$f":"SUM(F7:F9)","v":20},{"$f":"SUM(G7:G9)","v":29}]
[null,null,"Bioritm görbe kivonása (ha szükséges)",null,{"$f":"IF(E10<24,0,-23)","v":-23},{"$f":"IF(F10<29,0,-28)","v":0},{"$f":"IF(G10<34,0,-33)","v":0}]
[null,null,"Ha nagyobb még a szám",null,{"$f":"E10+E11","v":7},{"$f":"F10+F11","v":20},{"$f":"G10+G11","v":29}]
[null,null,"Marker",null,{"$f":"IF(E12>23,E12-23,E12)","v":7},{"$f":"IF(F12>28,F12-28,F12)","v":20},{"$f":"IF(G12>33,G12-33,G12)","v":29}]
[]
[]
[null,null,"7. Korona csakra:",{"$f":"VLOOKUP(G13,KronoAdatok!X2:AB35,3)","v":88},null,"Fizikai energia",null,{"$f":"D20+D21","v":117}]
[null,null,"6. Homlok csakra:",{"$f":"VLOOKUP(G13,KronoAdatok!X2:AB35,2)","v":29},null,"Érzelmi energia",null,{"$f":"D18+D19","v":76}]
[null,null,"5. Torok csakra:",{"$f":"VLOOKUP(F13,KronoAdatok!S2:V29,3)","v":32},null,"Szellemi energia",null,{"$f":"D16+D17","v":117}]
[null,null,"4. Szív csakra:",{"$f":"VLOOKUP(F13,KronoAdatok!S2:V29,2)","v":44},null,"Életenergia",null,{"$f":"H16+H17+H18","v":310}]
[null,null,"3. Köldök csakra:",{"$f":"VLOOKUP(E13,KronoAdatok!N2:Q24,3)","v":72}]
[null,null,"2. Szakrális csakra:",{"$f":"VLOOKUP(E13,KronoAdatok!N2:Q24,2)","v":45},null,"Jobb oldal női (yin)",null,{"$f":"D17+D19+D21","v":118}]
[null,null,"1. Gyökér csakra:",{"$f":"(D16+D17+D18+D19+D20+D21)/6","v":51.666666666666664},null,"Bal oldal férfi (yang)",null,{"$f":"D16+D18+D20","v":192}]
[]
[null,null,null,null,"Fizikai","Érzelmi","Intellektuális"]
[null,null,"A bioritmus markerei",null,{"$f":"E13","v":7},{"$f":"F13","v":20},{"$f":"G13","v":29}]
[]
[null,null,null,"Jobb oldal","Bal oldal"]
[null,null,"Fizikai kontúr",{"$f":"D21","v":45},{"$f":"D20","v":72},{"$f":"D28+E28","v":117},{"$f":"VLOOKUP(J28,KronoAdatok!M2:Q24,5,FALSE)","v":"Szangvinikus"},null,null,{"$f":"_xlfn.TEXTJOIN(\"-\",,D28,E28)","v":"45-72"}]
[null,null,"Érzelmi kontúr",{"$f":"D19","v":44},{"$f":"D18","v":32},{"$f":"D29+E29","v":76},{"$f":"VLOOKUP(J29,KronoAdatok!R2:V29,5,FALSE)","v":"Szentimentális"},null,null,{"$f":"_xlfn.TEXTJOIN(\"-\",,D29,E29)","v":"44-32"}]
[null,null,"Szellemi kontúr",{"$f":"D17","v":29},{"$f":"D16","v":88},{"$f":"D30+E30","v":117},{"$f":"VLOOKUP(J30,KronoAdatok!W2:AB34,6,FALSE)","v":"Produktív Gondolkodó"},null,{"$f":"IF(VLOOKUP(J30,KronoAdatok!W2:AB34,5,FALSE)=1,\"Mesterszám\",\"\")","v":"Mesterszám"},{"$f":"_xlfn.TEXTJOIN(\"-\",,D30,E30)","v":"29-88"}]
[null,null,null,{"$f":"D28+D29+D30","v":118},{"$f":"E28+E29+E30","v":192},{"$f":"F28+F29+F30","v":310}]
[]
[null,null,"Kronobiológia-számoló V1.4",null,null,null,null,"www.centralnet.hu"]

{"sheet":"KronoAdatok","index":2,"n_rows":139,"n_cols":28,"rows_kept":139,"cut":false,"hidden":true,"merged":[]}
["Év","Adat1","Adat2","Adat3","Szökőév",null,"sorszám","Hónap","Nap","Adat1","Adat2","Adat3",null,"Marker","Adat1","Adat2","Fizikai kontúr",null,"Marker","Adat1","Adat2","Érzelmi kontúr",null,"Marker","Adat1","Adat2","Mesterszám","Intellektuális kontúr"]
[1900,7,17,17,1,null,1,"Január",31,12,26,4,"33-55",1,33,55,"Közepesen szangvinikus","69-95",1,69,95,"Szenvedélyes","64-35",1,64,35,null,"Produktív Művészi"]
[1901,10,16,15,0,null,2,"Február",28,7,26,9,"55-72",2,55,72,"Szangvinikus","75-27",2,75,27,"Egoisztikus vezető","21-65",2,21,65,null,"Gondolkodó Harmónikus"]
[1902,13,15,13,0,null,3,"Március",31,22,23,11,"15-65",3,15,65,"Kolerikus","31-45",3,31,45,"Empatikus","21-65",3,21,65,null,"Gondolkodó Harmónikus"]
[1903,16,14,11,0,null,4,"Április",30,15,21,14,"50-72",4,50,72,"Szangvinikus","62-77",4,62,77,"Szenvedélyes","93-82",4,93,82,1,"Produktív Vegyes"]
[1904,18,12,8,1,null,5,"Május",31,7,18,16,"30-41",5,30,41,"Közepesen szangvinikus","50-59",5,50,59,"Empatikus","43-41",5,43,41,null,"Harmonimus Vegyes"]
[1905,21,11,6,0,null,6,"Június",30,0,16,19,"75-21",6,75,21,"Flegmatikus","44-68",6,44,68,"Empatikus","0-99",6,0,99,1,"Gondolkodó Harmónikus"]
[1906,1,10,4,0,null,7,"Július",31,15,13,21,"45-72",7,45,72,"Szangvinikus","12-45",7,12,45,"Önfeláldozó","57-88",7,57,88,null,"Produktív Gondolkodó"]
[1907,4,9,2,0,null,8,"Augusztus",31,7,10,23,"60-22",8,60,22,"Flegmatikus","6-23",8,6,23,"Hideg önfeláldozó","7-41",8,7,41,null,"Gyakorlati Gondolkodó"]
[1908,6,7,32,1,null,9,"Szeptember",30,0,8,26,"35-28",9,35,28,"Melankólikus","81-54",9,81,54,"Egoisztikus vezető","29-35",9,29,35,null,"Gyakorlati Gondolkodó"]
[1909,9,6,30,0,null,10,"Október",31,15,5,28,"35-49",10,35,49,"Közepesen szangvinikus","25-77",10,25,77,"Önfeláldozó","86-35",10,86,35,null,"Produktív Művészi"]
[1910,12,5,28,0,null,11,"November",30,8,3,31,"95-22",11,95,22,"Flegmatikus","18-50",11,18,50,"Önfeláldozó","29-82",11,29,82,1,"Produktív Gondolkodó"]
[1911,15,4,26,0,null,12,"December",31,0,0,0,"30-99",12,30,99,"Kolerikus","44-59",12,44,59,"Empatikus","86-41",12,86,41,null,"Produktív Művészi"]
[1912,17,2,23,1,null,13,"Január-szökőév",31,13,27,5,"40-61",13,40,61,"Szangvinikus","25-68",13,25,68,"Önfeláldozó","14-71",13,14,71,null,"Gondolkodó Harmónikus"]
[1913,20,1,21,0,null,14,"Február-szökőév",29,7,26,9,"20-55",14,20,55,"Kolerikus","50-77",14,50,77,"Szenvedélyes","50-59",14,50,59,null,"Harmonimus Vegyes"]
[1914,0,0,19,0,null,null,null,null,null,null,null,"40-28",15,40,28,"Melankólikus","50-99",15,50,99,"Szenvedélyes","78-65",15,78,65,null,"Produktív Vegyes"]
[1915,3,27,17,0,null,null,null,null,null,null,null,"90-21",16,90,21,"Flegmatikus","50-36",16,50,36,"Szentimentális","93-24",16,93,24,null,"Produktív Művészi"]
[1916,5,25,14,1,null,null,null,null,null,null,null,"50-83",17,50,83,"Szangvinikus","56-41",17,56,41,"Szentimentális","84-71",17,84,71,null,"Produktív Vegyes"]
[1917,8,24,12,0,null,null,null,null,null,null,null,"10-45",18,10,45,"Érzékeny kolerikus","31-14",18,31,14,"Hideg","29-41",18,29,41,null,"Gyakorlati Gondolkodó"]
[1918,11,23,10,0,null,null,null,null,null,null,null,"99-55",19,99,55,"Flegmatikus szangvinikus","99-54",19,99,54,"Egoisztikus vezető","26-71",19,26,71,null,"Gondolkodó Harmónikus"]
[1919,14,22,8,0,null,null,null,null,null,null,null,"30-52",20,30,52,"Közepesen szangvinikus","44-32",20,44,32,"Szentimentális","99-82",20,99,82,1,"Produktív Vegyes"]
[1920,16,20,5,1,null,null,null,null,null,null,null,"20-79",21,20,79,"Kolerikus","62-41",21,62,41,"Szentimentális","7-76",21,7,76,null,"Gondolkodó Harmónikus"]
[1921,19,19,3,0,null,null,null,null,null,null,null,"80-69",22,80,69,"Flegmatikus szangvinikus","25-18",22,25,18,"Hideg","14-35",22,14,35,null,"Gyakorlati Gondolkodó"]
[1922,22,18,1,0,null,null,null,null,null,null,null,"25-21",23,25,21,"Melankólikus","69-59",23,69,59,"Egoisztikus vezető","50-65",23,50,65,null,"Produktív Gondolkodó"]
[1923,2,17,32,0,null,null,null,null,null,null,null,null,null,null,null,null,"56-41",24,56,41,"Szentimentális","26-18",24,26,18,null,"Gyakorlati Művészi"]
[1924,4,15,29,1,null,null,null,null,null,null,null,null,null,null,null,null,"44-68",25,44,68,"Empatikus","29-88",25,29,88,1,"Produktív Gondolkodó"]
[1925,7,14,27,0,null,null,null,null,null,null,null,null,null,null,null,null,"37-41",26,37,41,"Empatikus","93-59",26,93,59,null,"Produktív Művészi"]
[1926,10,13,25,0,null,null,null,null,null,null,null,null,null,null,null,null,"56-73",27,56,73,"Szenvedélyes","57-82",27,57,82,null,"Produktív Gondolkodó"]
[1927,13,12,23,0,null,null,null,null,null,null,null,null,null,null,null,null,"44-73",28,44,73,"Empatikus","29-29",28,29,29,null,"Gyakorlati Vegyes"]
[1928,15,10,20,1,null,null,null,null,null,null,null,null,null,null,null,null,null,null,null,null,null,"29-88",29,29,88,1,"Produktív Gondolkodó"]
[1929,18,9,18,0,null,null,null,null,null,null,null,null,null,null,null,null,null,null,null,null,null,"71-47",30,71,47,null,"Produktív Művészi"]
[1930,21,8,16,0,null,null,null,null,null,null,null,null,null,null,null,null,null,null,null,null,null,"7-35",31,7,35,null,"Gyakorlati Gondolkodó"]
[1931,1,7,14,0,null,null,null,null,null,null,null,null,null,null,null,null,null,null,null,null,null,"64-59",32,64,59,null,"Produktív Vegyes"]
[1932,3,5,11,1,null,null,null,null,null,null,null,null,null,null,null,null,null,null,null,null,null,"29-82",33,29,82,1,"Produktív Gondolkodó"]
[1933,6,4,9,0]
[1934,9,3,7,0]
[1935,12,2,5,0]
[1936,14,0,2,1]
[1937,17,27,0,0]
[1938,20,26,31,0]
{"$rows_left_out":100}
{"sheet":"KronoMagyarázat","index":3,"n_rows":964,"n_cols":2,"rows_kept":964,"cut":false,"hidden":true,"merged":[]}
["Tipus","Magyarázat"]
["Melankólikus","FIZIKAI szint: Melankólikus"]
["Melankólikus","A két csakra értéke alacsony. Alacsony a Szakrális csakra értéke és alacsony a Gyomorcsakra értéke"]
["Melankólikus","is. (A két csakra összértéke kevesebb mint 70) "]
["Melankólikus","- Érzékeny "]
["Melankólikus","- Belső világában létezik "]
["Melankólikus","- Általában van példaképe. Ez azért fontos számára, mert nem bízik önmagában, és mindig kell neki"]
["Melankólikus","támaszték, ami felé tud haladni. "]
["Melankólikus","- Szégyenlős "]
["Melankólikus","- Új szituációban elveszik (Nem nagyon tudja, hogyan fogjon hozzá) "]
["Melankólikus","- Nehezen ismerkedik, idegen társaságban figyel, elemez, barátok közt kinyílik, humoros. "]
["Melankólikus","- Kevés barátja van, de azok mély barátságok "]
["Melankólikus","- Nem hisz az erőiben (inkább a gyengeségeire fókuszál, mint az értékeire) "]
["Melankólikus","- Befelé forduló, introvertált "]
["Melankólikus","- Fáradékony, néha enervált. Ez abból adódik, hogy kevés az energiája, amit fel tud használni. "]
["Melankólikus","- Inkább passzív pihenés való neki, mint az aktív pihenés. "]
["Melankólikus","- Csendes "]
["Melankólikus","- Magas követelményeket támaszt "]
["Melankólikus","- Érzékeny a kritikára (nem szereti, ha a gyengeségeire felhívják a figyelmet) "]
["Melankólikus","- Gyanakvó, nem tud felszabadult lenni, ez megint a kevés energiafelhasználással függ össze. "]
["Melankólikus","- Szenvedő alkat és ezt befelé teszi, nem kommunikálja ki a világ felé, hogy neki baja van."]
["Melankólikus","- Kevésbé tűnik aktívnak, inkább passzívnak tűnik "]
["Melankólikus","- Félénk "]
["Melankólikus","- Vonzódik a finom dolgokhoz "]
["Melankólikus","- Jó spirituális segítő "]
["Melankólikus"]
["Melankólikus","Melankolikus végletei: "]
["Melankólikus","- Egyáltalán nem hisz az erejében, nem hisz magában. "]
["Melankólikus","- Búskomor, túl érzékeny és társfüggő tud lenni. Minél kevesebb az összenergiája annál jobban nem"]
["Melankólikus","tud arra pazarolni energiát, hogy mosolyogjon. Enervált. "]
["Melankólikus","- Pesszimista, visszafogott, közömbös, határozatlan, nagyon nehezen hozza meg a döntéseit. "]
["Melankólikus","- Gyakran, többször kell pihennie, mint az átlagnak."]
["Melankólikus","- Legszívesebben magába zárkózik. Fizikai életereje, életenergiája az átlagtól alacsonyabb, ezért"]
["Melankólikus","számára fontos lenne a természettel való kapcsolódás. Nagyon ragaszkodik ahhoz, akit szeret."]
["Melankólikus","Az elhagyatottság érzés és a mellőzöttség érzése nagyon veszélyes számára. "]
["Melankólikus"]
["Melankólikus","A Melankólikus a munkában: "]
["Melankólikus","- Önálló / kitalálja és megvalósítja"]
["Melankólikus","- Jó szervező, aprólékos, ügyel a finom részletekre, el tud bíbelődni a végletekig, mindent finomít,"]
["Melankólikus","minden tökéletesre akar fejleszteni."]
{"$rows_left_out":925}
{"sheet":"Info","index":4,"n_rows":96,"n_cols":5,"rows_kept":96,"cut":false,"hidden":false,"merged":[[3,1,4,7],[46,1,46,8],[49,1,49,8],[52,1,52,8],[29,1,29,8],[31,1,31,8],[33,1,33,8],[35,1,35,8],[37,1,37,8],[39,1,39,8],[41,1,41,8],[43,1,43,8],[5,1,5,7],[63,1,63,8],[65,1,65,8],[66,1,66,8],[54,1,54,8],[55,1,55,8],[57,1,57,8],[58,1,58,8],[59,1,59,8],[60,1,60,8],[79,1,79,8],[80,1,80,8],[81,1,81,8],[82,1,82,8],[73,1,73,8],[75,1,75,8],[76,1,76,8],[77,1,77,8],[78,1,78,8],[67,1,67,8],[68,1,68,8],[69,1,69,8],[70,1,70,8],[71,1,71,8],[92,1,93,7],[94,1,94,7],[8,1,8,7],[9,1,9,7],[23,1,23,8],[25,1,25,8],[19,2,19,8],[20,2,20,8],[21,2,21,8],[22,2,22,8],[85,1,85,8],[86,1,86,8],[87,1,87,8],[88,1,88,8],[83,1,83,8],[61,1,61,8]]}
[]
[]
[]
[null,"A szoftver továbbértékesítése, módosítása nem megengedett, megvásárolható, vagy a DEMÓ verzió letölthető a honlapról."]
[]
[null,"A DEMÓ verzió korlátai:"]
[null,"- Csak a rögzített dátumokkal használható"]
[null,"- Új időpont nem rögzíthető benne"]
[]
[null,"A teljes program megvásárolható vagy elemzés kérhető: www.centralnet.hu/kronobiologia"]
[null,"Információk: https://www.facebook.com/groups/egyuttazutunkon"]
[null,"Tanfolyam: Lásd a lap alján!"]
[]
[]
[]
[]
[null,"A program használata:"]
[null,"KronoBiológia lapon"]
[null,"- Megnyitás gomb: Már rögzített adatok betöltése, módosítása, új adatok rögzítése."]
[null,null,"Új személy: értelem szerűen új adat bevitelére szolgál. (Menteni szükséges a végén)"]
[null,null,"Módosítás: alul a listában kijelölz személy adatait betölti és módosítható (Menteni szükséges a végén)"]
[null,null,"Törlés: alul a listában kijelölt személyt törli."]
[null,null,"Betöltés: alul a listában kijelölt személyt betölti elemzésre az oldalra. A számolt adatai rögtön láthatók."]
[null,"- Elemzés gomb: A betöltött adatokból elemzést készít, mely pdf-be menthető illetve nyomtatható."]
[]
[null,"- Dátum: A dátumot nem figyeli, hogy helyes e! Február 30 nincs, akkor sem ha beírod :) Számolni fog vele, de hibásan. (úgy értelmezi, mintha Március 2-t írtál volna) Idővel javítva lesz."]
[]
[]
[null,"Kronobiologiáról"]
[null,"Születésünk dátumából megállapítható, hogy milyen egész életünkre kiható tulajdonságokkal ruházott fel bennünket az Univerzum. A kronobiológia keretein belül megismerhetjük saját születési energiáinkat, \nszemélyiségünk fizikai, érzelmi és intellektuális alappilléreit, saját tetteink és kapcsolataink mozgatórugóit."]
[]
[null,"A Kronobiológia pszichogenetika, egy fiatal tudományág, amely a pszichológiai ismeretek, a bioritmus elmélet, a fiziológiai tudás, a keleti orvoslás és a kvantumfizikai elképzelések találkozásának határmezsgyéjén elhelyezkedő hihetetlen széles óriási Arsenalból merítő tudományágról beszélhetünk.... \nami 1981-ben a volt Szovjetunióban született meg. Kidolgozója doktor Artur \nVlagyimirovics Zsazskov, akinek munkásságát Magyarországon Dr Szmirnova \nTatjana Ivanovna folytatja. "]
[]
[null,"Dr Zsazskóv azt vizsgálta, azt kutatta, hogy hogyan hathat a születési időpont az emberre, hogyan lehet az embereket tipizálni. És a munkacsoportjával, közel 20 ezer sikeres embert vizsgáltak meg, 16 különböző szakterületen, születési dátumok szerint."]
[]
[null,"A kronobiológiai zseniális módon segít fizikailag, érzelmileg és intellektuálisan abban, hogy megtaláljuk azt a hangot a másikkal, ami az ő hangja. És abban is segít, hogy kivagyok én.\nTehát saját magammal megtaláljam a hangot.\nTehát Zsazskovék azt vették észre, hogy pusztán a születési dátumukból ezeknek az embereknél három bioritmus alapján nagyon jól be lehetett azt határolni, hogy miben a legjobbak ők. Ezeket összevetve azt állapította meg, hogy egy táblázat segítségével a születési dátumból ki tudjuk számolni az egyént jellemző energiákat fizikai szinten, érzelmi szinten és intellektuálisan. Ebből Pedig meg mondható, hogy mi az ő természetes tehetsége, potenciálja. "]
[]
[null,"A fizikailag 23 napos ciklust ölel fel, az érzelmileg 28 napos ciklust, intellektuálisan pedig 33 napos ciklust ölel fel. "]
[]
[null,"Azért jó, ha megismerjük a tulajdonságainkat, az erősségeinket, és a gyengeségeinket. Ugyanis, nagyon sokszor úgy kezdjük el viszonyítani magunkat, hogy mások mit mondanak rólunk. Mit mondtak a szüleink, mit mondtak a tanáraink vagy a főnökünk. Mit mondanak más emberek, hogyan értékeltek, hogyan értékelnek minket. Viszont nekünk, tökéletesen az értékeinkre kell, koncentrálunk. Miért? Mert ha arra koncentrálunk, akkor a legjobb formánkat hozzuk. Ha gyengeségeinkre, akkor biztos, hogy lúzernak fogjuk érezni magunkat. És ez ugye nem egy kényelmes állapot. Mindenkinek vannak jó, és jobb tulajdonságai. Ha értékeidre támaszkodsz, akkor azt tudod fejleszteni. \nEzáltal zseniális leszel. Tudod, hogy amit csinálsz, abban te vagy a legjobb.  Viszont, ha a gyengeségeidre fókuszálsz, akkor millió egy kifogást, fogsz találni, hogy miért nem működnek a dolgok. A kronobiológia pontosan abban fog segíteni, hogy fizikailag, érzelmileg és intellektuálisan megtaláld azt a saját belső erődet, amire támaszkodni tudsz."]
{"$rows_left_out":57}
{"sheet":"KronoElemzés","index":5,"n_rows":311,"n_cols":9,"rows_kept":311,"cut":false,"hidden":false,"merged":[[2,2,2,3]]}
[]
["Név:","Vanessa Paradis",null,null,null,"Kronobiológia-számoló V1.4",null,null,"www.centralnet.hu"]
["Születési idő:",null,"1972-12-22",null,null,"A program tulajdonosa:",null,null,"DEMO"]
[]
[]
[]
[]
[]
[]
[]
[]
[]
[]
[]
[]
[]
[]
[]
[]
[]
[]
[]
[]
["FIZIKAI szint: Szangvinikus (Az \"életörömmel teli\")"]
["- Megbízhatatlan, rengeteg dolgot megígér, de az új élmények felülírják. Ígéreteket tesz, a marketingje"]
["tökéletes, csak nem marad rá idő, hogy befejezze a dolgokat, mert felülírják a következő éppen "]
["aktuális dolgok."]
["- Erős, kiegyensúlyozott idegrendszerű, mozgékony, jó a mozgáskoordinációja. Énekel, dudorászik "]
["vagy táncol, mert van hozzá energiája."]
["- Gyorsan alakulnak ki az érzelmei, de az újabb izgalmas élmények elcsábíthatják. Érzelmileg nagyon"]
["gyorsan vált. "]
["- Ingerlékeny, lobbanékony, szeszélyes, és szenvedélyes, lendületes, pörgős "]
["- Beszédes, aktív, élénk, mozgékony, sok mindent csinál egyszerre "]
["- Türelmetlen, mindent előbb akar, mint ahogy az élet adja. Állandó időzavarban van, mert túl sok "]
["mindent tesz egyszerre, ezért az idő, mint olyan, nehezen kezelhető számára."]
["- Rugalmas, jó csapatjátékos "]
["- Kezdeményező, beszédes, közvetlen. Úgy tűnik, hogy mindenhez hozzá tud szólni, de nem sokáig"]
[" marad benne. Annyira nem érdekli ő az adott téma, hogy sokáig benne is maradjon, de mégis úgy"]
[" éli meg az ember, hogy jó volt vele beszélgetni, hozott egy kis szint a társalgásba "]
[]
{"$rows_left_out":272}
{"sheet":"Regisztráció","index":6,"n_rows":7,"n_cols":2,"rows_kept":7,"cut":false,"hidden":false,"merged":[[0,1,0,6],[2,1,2,6]]}
[null,"Regisztrációs felület"]
[]
[null,"A regisztrációs filet másold be abba a könyvtárba ahol a program található, majd nyomd meg a regisztrálom gombot."]
[]
[]
[null,"Ezt a file-t keresi a program:"]
[null,"Krono-regisztracio.xlsx"]